BDBM50287713 [methyl(2-{[(phosphonatooxy)phosphinato]oxy}ethyl)amino]acetate
SMILES CN(CCOP([O-])(=O)OP([O-])([O-])=O)CC([O-])=O
InChI Key InChIKey=YERUUUBBRAPJND-UHFFFAOYSA-J
Data  1 KI
  Tab Delimited (TSV)   2D SDfile   Computed 3D by Vconf -m prep SDfile
Find this compound or compounds like it in BindingDB:
Activity Spreadsheet -- Enzyme Inhibition Constant Data from BindingDB
Found 1 hit for monomerid = 50287713
TargetDiphosphomevalonate decarboxylase(Homo sapiens (Human))
TBA
Curated by ChEMBL
LigandPNGBDBM50287713([methyl(2-{[(phosphonatooxy)phosphinato]oxy}ethyl)...)
Affinity DataKi:  750nM. Assay description: Compound was evaluated for its inhibitory activity against Mevalonate 5-pyrophosphate decarboxylase
In DepthDetails Article