BDBM50287780 (S)-1-((R)-2-Amino-3-phenyl-propionyl)-pyrrolidine-2-carboxylic acid [(S)-1-(2-chloro-acetyl)-4-guanidino-butyl]-amide::(S)-1-((R)-2-amino-3-phenylpropanoyl)-N-((S)-1-chloro-6-guanidino-2-oxohexan-3-yl)pyrrolidine-2-carboxamide::CHEMBL307440
SMILES N[C@H](Cc1ccccc1)C(=O)N1CCC[C@H]1C(=O)N[C@@H](CCCNC(N)=N)C(=O)CCl
InChI Key InChIKey=KWPACVJPAFGBEQ-IKGGRYGDSA-N
Data  1 KI  1 IC50
PDB links: 4 PDB IDs match this monomer.
  Tab Delimited (TSV)   2D SDfile   Computed 3D by Vconf -m prep SDfile
Find this compound or compounds like it in BindingDB:
Activity Spreadsheet -- Enzyme Inhibition Constant Data from BindingDB
Found 2 hits for monomerid = 50287780
TargetCoagulation factor XII(Homo sapiens (Human))
University Of Namur
Curated by ChEMBL
LigandPNGBDBM50287780((S)-1-((R)-2-Amino-3-phenyl-propionyl)-pyrrolidine...)
Affinity DataKi:  230nM. Assay description: Inhibition of human factor 12a using H-D-Pro-Phe-Arg-pNa as substrate by spectrophotometric method
In DepthDetails ArticlePubMed
TargetProthrombin(Homo sapiens (Human))
TBA
Curated by ChEMBL
LigandPNGBDBM50287780((S)-1-((R)-2-Amino-3-phenyl-propionyl)-pyrrolidine...)
Affinity DataIC50:  1.5nM. Assay description: Inhibition of thrombin