BDBM50288643 CHEMBL106132::[Phenyl-(2-trifluoromethyl-phenyl)-methyl]-phosphonic acid
SMILES OP(O)(=O)C(c1ccccc1)c1ccccc1C(F)(F)F
InChI Key InChIKey=OCBYAVPAQOOKIU-UHFFFAOYSA-N
Data  1 IC50
  Tab Delimited (TSV)   2D SDfile   Computed 3D by Vconf -m prep SDfile
Find this compound or compounds like it in BindingDB:
Activity Spreadsheet -- Enzyme Inhibition Constant Data from BindingDB
Found 1 hit for monomerid = 50288643
TargetProstatic acid phosphatase(Homo sapiens (Human))
TBA
Curated by ChEMBL
LigandPNGBDBM50288643(CHEMBL106132 | [Phenyl-(2-trifluoromethyl-phenyl)-...)
Affinity DataIC50:  9.00E+3nM. Assay description: Inhibition of human prostatic acid phosphatase was determined as inhibition of the hydrolysis of tyrosine phosphate
In DepthDetails Article