BDBM50288650 CHEMBL107540::[2-Phenyl-1-(3-trifluoromethyl-phenyl)-ethyl]-phosphonic acid
SMILES OP(O)(=O)C(Cc1ccccc1)c1cccc(c1)C(F)(F)F
InChI Key InChIKey=SAHLSPFOTOALLV-UHFFFAOYSA-N
Data  1 IC50
  Tab Delimited (TSV)   2D SDfile   Computed 3D by Vconf -m prep SDfile
Find this compound or compounds like it in BindingDB:
Activity Spreadsheet -- Enzyme Inhibition Constant Data from BindingDB
Found 1 hit for monomerid = 50288650
TargetProstatic acid phosphatase(Homo sapiens (Human))
TBA
Curated by ChEMBL
LigandPNGBDBM50288650(CHEMBL107540 | [2-Phenyl-1-(3-trifluoromethyl-phen...)
Affinity DataIC50:  1.00E+5nM. Assay description: Inhibition of human prostatic acid phosphatase was determined as inhibition of the hydrolysis of tyrosine phosphate
In DepthDetails Article