BDBM50289047 CHEMBL162721::N-(2,4,6-Trifluoro-phenyl)-malonamic acid 2,6-diisopropyl-phenyl ester
SMILES CC(C)c1cccc(C(C)C)c1OC(=O)CC(=O)Nc1c(F)cc(F)cc1F
InChI Key InChIKey=UCVOKWYBENZMBJ-UHFFFAOYSA-N
Data  1 IC50
  Tab Delimited (TSV)   2D SDfile   Computed 3D by Vconf -m prep SDfile
Find this compound or compounds like it in BindingDB:
Activity Spreadsheet -- Enzyme Inhibition Constant Data from BindingDB
Found 1 hit for monomerid = 50289047
TargetAcyl-CoA:cholesterol acyltransferase(Oryctolagus cuniculus)
TBA
Curated by ChEMBL
LigandPNGBDBM50289047(CHEMBL162721 | N-(2,4,6-Trifluoro-phenyl)-malonami...)
Affinity DataIC50: >5.00E+3nM. Assay description: In vitro inhibitory activity against Acyl coenzyme A:cholesterol acyltransferase in intestinal microsomes isolated from cholesterol fed rabbits (IAI)...
In DepthDetails Article