BDBM50289049 CHEMBL164260::N-(2,6-Difluoro-phenyl)-malonamic acid 2,6-diisopropyl-phenyl ester
SMILES CC(C)c1cccc(C(C)C)c1OC(=O)CC(=O)Nc1c(F)cccc1F
InChI Key InChIKey=WWQRVDUPZBLEMB-UHFFFAOYSA-N
Data  1 IC50
  Tab Delimited (TSV)   2D SDfile   Computed 3D by Vconf -m prep SDfile
Find this compound or compounds like it in BindingDB:
Activity Spreadsheet -- Enzyme Inhibition Constant Data from BindingDB
Found 1 hit for monomerid = 50289049
TargetAcyl-CoA:cholesterol acyltransferase(Oryctolagus cuniculus)
TBA
Curated by ChEMBL
LigandPNGBDBM50289049(CHEMBL164260 | N-(2,6-Difluoro-phenyl)-malonamic a...)
Affinity DataIC50:  6.20E+3nM. Assay description: In vitro inhibitory activity against Acyl coenzyme A:cholesterol acyltransferase in intestinal microsomes isolated from cholesterol fed rabbits (IAI)...
In DepthDetails Article