BDBM50290864 3-[1-(3,5-Bis-trifluoromethyl-phenyl)-ethoxy]-2-phenyl-piperidine::CHEMBL316486
SMILES C[C@H](O[C@H]1CCCN[C@H]1c1ccccc1)c1cc(cc(c1)C(F)(F)F)C(F)(F)F
InChI Key InChIKey=AXRHJNPWSRJZKN-AGRHKRQWSA-N
Data  1 IC50
  Tab Delimited (TSV)   2D SDfile   Computed 3D by Vconf -m prep SDfile
Find this compound or compounds like it in BindingDB:
Activity Spreadsheet -- Enzyme Inhibition Constant Data from BindingDB
Found 1 hit for monomerid = 50290864
TargetSubstance-P receptor(Rattus norvegicus (rat))
TBA
Curated by ChEMBL
LigandPNGBDBM50290864(3-[1-(3,5-Bis-trifluoromethyl-phenyl)-ethoxy]-2-ph...)
Affinity DataIC50:  87nM. Assay description: Antagonism of NK1 receptor in rat liver microsomes.
In DepthDetails Article