BDBM50293014 CHEMBL506278::Methyl 4-((4-(2-(6,7-dimethoxy-1,2,3,4-tetrahydroisoquinolin-2-yl)ethyl)phenyl)aminocarbonyl)-2-(quinoxaline-2-carbonylamino)benzoate
SMILES COC(=O)c1ccc(cc1NC(=O)c1cnc2ccccc2n1)C(=O)Nc1ccc(CCN2CCc3cc(OC)c(OC)cc3C2)cc1
InChI Key InChIKey=PFSYTCDBLGSLFB-UHFFFAOYSA-N
Data  2 IC50
  Tab Delimited (TSV)   2D SDfile   Computed 3D by Vconf -m prep SDfile
Find this compound or compounds like it in BindingDB:
Activity Spreadsheet -- Enzyme Inhibition Constant Data from BindingDB
Found 2 hits for monomerid = 50293014
TargetATP-dependent translocase ABCB1(Homo sapiens (Human))
University Of Regensburg
Curated by ChEMBL
LigandPNGBDBM50293014(CHEMBL506278 | Methyl 4-((4-(2-(6,7-dimethoxy-1,2,...)
Affinity DataIC50: >3.40E+4nM. Assay description: Inhibition of ABCB1 overexpressed in human KBv1 cells by flow cytometric-based calcein-AM efflux assay
In DepthDetails ArticlePubMed
TargetBroad substrate specificity ATP-binding cassette transporter ABCG2(Homo sapiens (Human))
University Of Regensburg
Curated by ChEMBL
LigandPNGBDBM50293014(CHEMBL506278 | Methyl 4-((4-(2-(6,7-dimethoxy-1,2,...)
Affinity DataIC50:  183nM. Assay description: Inhibition of ABCG2 overexpressed in human MCF7/Topo cells by flow cytometric-based mitoxantrone efflux assay
In DepthDetails ArticlePubMed