BDBM50294135 CHEMBL563339::Trifluoro-acetate(S)-3-{(R)-3-[(4-bromo-phenyl)-hydroxy-carbamoyl]-1-carboxyaminocarbonyl-propylcarbamoyl}-1-carboxy-propyl-ammonium
SMILES [NH3+][C@@H](CCC(=O)N[C@H](CCC(=O)N(O)c1ccc(Br)cc1)C(=O)NCC(O)=O)C(O)=O
InChI Key InChIKey=UAMMSMJEDFEBAR-QWHCGFSZSA-O
Data  1 KI
  Tab Delimited (TSV)   2D SDfile   Computed 3D by Vconf -m prep SDfile
Find this compound or compounds like it in BindingDB:
Activity Spreadsheet -- Enzyme Inhibition Constant Data from BindingDB
Found 1 hit for monomerid = 50294135
TargetGlyoxalase I(Saccharomyces cerevisiae)
University Of Minnesota
Curated by ChEMBL
LigandPNGBDBM50294135(CHEMBL563339 | Trifluoro-acetate(S)-3-{(R)-3-[(4-b...)
Affinity DataKi:  1.66E+3nM. Assay description: Inhibition of yeast glyoxalase 1
In DepthDetails ArticlePubMed