BDBM50296224 1-(4-(3-morpholinopropoxy)phenyl)-3-(4-(trifluoromethoxy)phenyl)urea::CHEMBL551521
SMILES FC(F)(F)Oc1ccc(NC(=O)Nc2ccc(OCCCN3CCOCC3)cc2)cc1
InChI Key InChIKey=MHYBNAYVNVIZDS-UHFFFAOYSA-N
Data  1 IC50
  Tab Delimited (TSV)   2D SDfile   Computed 3D by Vconf -m prep SDfile
Find this compound or compounds like it in BindingDB:
Activity Spreadsheet -- Enzyme Inhibition Constant Data from BindingDB
Found 1 hit for monomerid = 50296224
TargetBifunctional epoxide hydrolase 2(Homo sapiens (Human))
Arete Therapeutics
Curated by ChEMBL
LigandPNGBDBM50296224(1-(4-(3-morpholinopropoxy)phenyl)-3-(4-(trifluorom...)
Affinity DataIC50:  0.800nM. Assay description: Inhibition of human soluble epoxide hydrolase by fluorescent endpoint assay
In DepthDetails ArticlePubMed