BDBM50296506 CHEMBL550598::Trifluoro-acetate(2R,3R)-7-methoxy-3-(2,4,5-trifluoro-phenyl)-1,2,3,4-tetrahydro-benzo[4,5]imidazo[1,2-a]pyridin-2-yl-ammonium
SMILES COc1ccc2n3C[C@H]([NH3+])[C@H](Cc3nc2c1)c1cc(F)c(F)cc1F
InChI Key InChIKey=MKZBHJLNXBSVNZ-ABAIWWIYSA-O
Data  4 IC50
  Tab Delimited (TSV)   2D SDfile   Computed 3D by Vconf -m prep SDfile
Find this compound or compounds like it in BindingDB:
Activity Spreadsheet -- Enzyme Inhibition Constant Data from BindingDB
Found 4 hits for monomerid = 50296506
TargetDipeptidyl peptidase 4(Homo sapiens (Human))
Merck
Curated by ChEMBL
LigandPNGBDBM50296506(CHEMBL550598 | Trifluoro-acetate(2R,3R)-7-methoxy-...)
Affinity DataIC50:  28nM. Assay description: Inhibition of human recombinant DPP4
In DepthDetails ArticlePubMed
TargetDipeptidyl peptidase 9(Homo sapiens (Human))
Merck
Curated by ChEMBL
LigandPNGBDBM50296506(CHEMBL550598 | Trifluoro-acetate(2R,3R)-7-methoxy-...)
Affinity DataIC50:  7.30E+4nM. Assay description: Inhibition of human DPP9 expressed in baculovirus by continuous fluorescent assay
In DepthDetails ArticlePubMed
TargetDipeptidyl peptidase 8(Homo sapiens (Human))
Merck
Curated by ChEMBL
LigandPNGBDBM50296506(CHEMBL550598 | Trifluoro-acetate(2R,3R)-7-methoxy-...)
Affinity DataIC50: >1.00E+5nM. Assay description: Inhibition of human DPP8 expressed in baculovirus by continuous fluorescent assay
In DepthDetails ArticlePubMed
TargetDipeptidyl peptidase 2(Homo sapiens (Human))
Merck
Curated by ChEMBL
LigandPNGBDBM50296506(CHEMBL550598 | Trifluoro-acetate(2R,3R)-7-methoxy-...)
Affinity DataIC50:  7.30E+4nM. Assay description: Inhibition of human recombinant QPP transfected in insect SF9 cells
In DepthDetails ArticlePubMed