BDBM50296509 CHEMBL560669::Trifluoro-acetate(2R,3R)-8-fluoro-3-(2,4,5-trifluoro-phenyl)-1,2,3,4-tetrahydro-benzo[4,5]imidazo[1,2-a]pyridin-2-yl-ammonium
SMILES [NH3+][C@H]1Cn2c(C[C@@H]1c1cc(F)c(F)cc1F)nc1ccc(F)cc21
InChI Key InChIKey=BDGWBXCTQZVKNR-YGRLFVJLSA-O
Data  5 IC50
  Tab Delimited (TSV)   2D SDfile   Computed 3D by Vconf -m prep SDfile
Find this compound or compounds like it in BindingDB:
Activity Spreadsheet -- Enzyme Inhibition Constant Data from BindingDB
Found 5 hits for monomerid = 50296509
TargetDipeptidyl peptidase 4(Homo sapiens (Human))
Merck
Curated by ChEMBL
LigandPNGBDBM50296509(CHEMBL560669 | Trifluoro-acetate(2R,3R)-8-fluoro-3...)
Affinity DataIC50:  17nM. Assay description: Inhibition of human recombinant DPP4
In DepthDetails ArticlePubMed
TargetDipeptidyl peptidase 2(Homo sapiens (Human))
Merck
Curated by ChEMBL
LigandPNGBDBM50296509(CHEMBL560669 | Trifluoro-acetate(2R,3R)-8-fluoro-3...)
Affinity DataIC50:  2.30E+4nM. Assay description: Inhibition of human recombinant QPP transfected in insect SF9 cells
In DepthDetails ArticlePubMed
TargetPotassium voltage-gated channel subfamily H member 2(Homo sapiens (Human))
Merck
Curated by ChEMBL
LigandPNGBDBM50296509(CHEMBL560669 | Trifluoro-acetate(2R,3R)-8-fluoro-3...)
Affinity DataIC50:  1.70E+4nM. Assay description: Inhibition of human ERG
In DepthDetails ArticlePubMed
TargetDipeptidyl peptidase 9(Homo sapiens (Human))
Merck
Curated by ChEMBL
LigandPNGBDBM50296509(CHEMBL560669 | Trifluoro-acetate(2R,3R)-8-fluoro-3...)
Affinity DataIC50:  7.90E+4nM. Assay description: Inhibition of human DPP9 expressed in baculovirus by continuous fluorescent assay
In DepthDetails ArticlePubMed
TargetDipeptidyl peptidase 8(Homo sapiens (Human))
Merck
Curated by ChEMBL
LigandPNGBDBM50296509(CHEMBL560669 | Trifluoro-acetate(2R,3R)-8-fluoro-3...)
Affinity DataIC50: >1.00E+5nM. Assay description: Inhibition of human DPP8 expressed in baculovirus by continuous fluorescent assay
In DepthDetails ArticlePubMed