BDBM50296688 4-cyclohexylphenyl 4-(hexyloxy)benzoate::CHEMBL564104
SMILES CCCCCCOc1ccc(cc1)C(=O)Oc1ccc(cc1)C1CCCCC1
InChI Key InChIKey=HZGFEYRPLLRVMA-UHFFFAOYSA-N
Data  1 KI  1 IC50
  Tab Delimited (TSV)   2D SDfile   Computed 3D by Vconf -m prep SDfile
Find this compound or compounds like it in BindingDB:
Activity Spreadsheet -- Enzyme Inhibition Constant Data from BindingDB
Found 2 hits for monomerid = 50296688
TargetMetabotropic glutamate receptor 1(RAT)
Merz Pharmaceuticals
Curated by ChEMBL
LigandPNGBDBM50296688(4-cyclohexylphenyl 4-(hexyloxy)benzoate | CHEMBL56...)
Affinity DataKi: >4.00E+4nM. Assay description: Displacement of [3H]E-3-(2-chloro-8-methylquinolin-3-yl)-1-(thiophen-2-yl)prop-2-en-1-one from mGluR1 in rat cerebellar membrane after 14 to 16 hrs b...
In DepthDetails ArticlePubMed
TargetMetabotropic glutamate receptor 1(RAT)
Merz Pharmaceuticals
Curated by ChEMBL
LigandPNGBDBM50296688(4-cyclohexylphenyl 4-(hexyloxy)benzoate | CHEMBL56...)
Affinity DataIC50: >4.00E+4nM. Assay description: Allosteric antagonist activity at mGluR1 in Sprague-Dawley rat cerebellar granule cells assessed as accumulation of [3H]inositol phosphate by liquid ...
In DepthDetails ArticlePubMed