BDBM50298506 (S)-5-(3-(5-amino-2-(furan-2-yl)-7H-pyrazolo[4,3-e][1,2,4]triazolo[1,5-c]pyrimidin-7-yl)propyl)benzo[d][1,3]dioxole-2-carboxylic acid::CHEMBL574701
SMILES Nc1nc2n(CCCc3ccc4O[C@@H](Oc4c3)C(O)=O)ncc2c2nc(nn12)-c1ccco1
InChI Key InChIKey=AFOOOKGSRGDTCL-FQEVSTJZSA-N
Data  2 KI
  Tab Delimited (TSV)   2D SDfile   Computed 3D by Vconf -m prep SDfile
Find this compound or compounds like it in BindingDB:
Activity Spreadsheet -- Enzyme Inhibition Constant Data from BindingDB
Found 2 hits for monomerid = 50298506
TargetAdenosine receptor A2a(Homo sapiens (Human))
Universit£
Curated by ChEMBL
LigandPNGBDBM50298506((S)-5-(3-(5-amino-2-(furan-2-yl)-7H-pyrazolo[4,3-e...)
Affinity DataKi:  59nM. Assay description: Displacement of [3H]NECA from human adenosine A2A receptor expressed in CHO cellsChecked by Author
In DepthDetails ArticlePubMed
TargetAdenosine receptor A3(Homo sapiens (Human))
Universit£
Curated by ChEMBL
LigandPNGBDBM50298506((S)-5-(3-(5-amino-2-(furan-2-yl)-7H-pyrazolo[4,3-e...)
Affinity DataKi: >1.00E+4nM. Assay description: Displacement of [3H]NECA from human adenosine A3 receptor expressed in CHO cellsChecked by Author
In DepthDetails ArticlePubMed