BDBM50299107 3-Descladinosyl-11,12-dideoxy-6-O-methyl-3-oxo-12,11-(oxycarbonyl-(1-((3-hydroxy[1,8]naphthyridin-4-yl)methyl)azetidin-3-yl)imino)erythromycin A::CHEMBL583298
SMILES CC[C@H]1OC(=O)[C@H](C)C(=O)[C@H](C)[C@@H](O[C@@H]2O[C@H](C)C[C@@H]([C@H]2O)N(C)C)[C@](C)(O)C[C@@H](C)C(=O)[C@H](C)[C@H]2N(C3CN(Cc4c(O)cnc5ncccc45)C3)C(=O)O[C@]12C
InChI Key InChIKey=KNDXCMQNZXPRGV-UIPKLHSNSA-N
Data  1 IC50
  Tab Delimited (TSV)   2D SDfile   Computed 3D by Vconf -m prep SDfile
Find this compound or compounds like it in BindingDB:
Activity Spreadsheet -- Enzyme Inhibition Constant Data from BindingDB
Found 1 hit for monomerid = 50299107
TargetPotassium voltage-gated channel subfamily H member 2(Homo sapiens (Human))
Pfizer
Curated by ChEMBL
LigandPNGBDBM50299107(3-Descladinosyl-11,12-dideoxy-6-O-methyl-3-oxo-12,...)
Affinity DataIC50:  1.40E+5nM. Assay description: Inhibition of human ERG by patch-clamp assay
In DepthDetails ArticlePubMed