BDBM50299940 CHEMBL578605::[6-Chloro-2-oxo-4-(trifluoromethyl)-1,4-dihydro-2H-3,1-benzoxazin-4-yl]methyl-(4-fluorophenyl)carbamate
SMILES Fc1ccc(NC(=O)OCC2(OC(=O)Nc3ccc(Cl)cc23)C(F)(F)F)cc1
InChI Key InChIKey=STVRTRQYADRHPO-UHFFFAOYSA-N
Data  1 IC50
  Tab Delimited (TSV)   2D SDfile   Computed 3D by Vconf -m prep SDfile
Find this compound or compounds like it in BindingDB:
Activity Spreadsheet -- Enzyme Inhibition Constant Data from BindingDB
Found 1 hit for monomerid = 50299940
TargetElongation of very long chain fatty acids protein 6(Homo sapiens (Human))
Tsukuba Research Institute
Curated by ChEMBL
LigandPNGBDBM50299940(CHEMBL578605 | [6-Chloro-2-oxo-4-(trifluoromethyl)...)
Affinity DataIC50:  142nM. Assay description: Inhibition of human ELOVL6 expressed in Pichia pastoris using palmitoyl-CoA by long chain fatty acyl-CoA elongation assay
In DepthDetails ArticlePubMed