BDBM50299943 (6-chloro-2-oxo-4-(propan-2-yl)-1,4-dihydro-2H-3,1-benzoxazin-4-yl)methyl(4-fluorophenyl)carbamate::CHEMBL583665
SMILES CC(C)C1(COC(=O)Nc2ccc(F)cc2)OC(=O)Nc2ccc(Cl)cc12
InChI Key InChIKey=GUQFSODZHDWFSC-UHFFFAOYSA-N
Data  1 IC50
  Tab Delimited (TSV)   2D SDfile   Computed 3D by Vconf -m prep SDfile
Find this compound or compounds like it in BindingDB:
Activity Spreadsheet -- Enzyme Inhibition Constant Data from BindingDB
Found 1 hit for monomerid = 50299943
TargetElongation of very long chain fatty acids protein 6(Homo sapiens (Human))
Tsukuba Research Institute
Curated by ChEMBL
LigandPNGBDBM50299943((6-chloro-2-oxo-4-(propan-2-yl)-1,4-dihydro-2H-3,1...)
Affinity DataIC50:  5.03E+3nM. Assay description: Inhibition of human ELOVL6 expressed in Pichia pastoris using palmitoyl-CoA by long chain fatty acyl-CoA elongation assay
In DepthDetails ArticlePubMed