BDBM50300240 3-(3-chlorophenethyl)pyridin-2-amine::3-[2-(3-chlorophenyl)ethyl]pyridin-2-amine::CHEMBL575232
SMILES Nc1ncccc1CCc1cccc(Cl)c1
InChI Key InChIKey=XJCJGDOLNLEZIY-UHFFFAOYSA-N
Data  1 Kd
PDB links: 1 PDB ID matches this monomer.
  Tab Delimited (TSV)   2D SDfile   Computed 3D by Vconf -m prep SDfile
Find this compound or compounds like it in BindingDB:
Activity Spreadsheet -- Enzyme Inhibition Constant Data from BindingDB
Found 1 hit for monomerid = 50300240
TargetBeta-secretase 1(Homo sapiens (Human))
Schering-Plough Research Institute
Curated by ChEMBL
LigandPNGBDBM50300240(3-(3-chlorophenethyl)pyridin-2-amine | 3-[2-(3-chl...)
Affinity DataKd:  3.20E+4nM. Assay description: Binding affinity to BACE1 by fragment-based NMR screening assay