BDBM503003 US11033539, Cpd. No. 9-14::methyl 4-(4-{[2-(1-benzylpiperidin-4- yl)ethyl]carbamoyl}phenyl)benzoate
SMILES COC(=O)c1ccc(cc1)-c1ccc(cc1)C(=O)NCCC1CCN(Cc2ccccc2)CC1
InChI Key InChIKey=PERNPHVSXDNDJP-UHFFFAOYSA-N
Data  1 KI
  Tab Delimited (TSV)   2D SDfile   Computed 3D by Vconf -m prep SDfile
Find this compound or compounds like it in BindingDB:
Activity Spreadsheet -- Enzyme Inhibition Constant Data from BindingDB
Found 1 hit for monomerid = 503003
TargetMuscarinic acetylcholine receptor M4(Homo sapiens (Human))
Neurocrine Biosciences
US Patent
LigandPNGBDBM503003(US11033539, Cpd. No. 9-14 | methyl 4-(4-{[2-(1-ben...)
Affinity DataKi:  55nM. Assay description: Binding affinity (Ki) of compounds was measured by inhibition of radioligand binding to membranes from CHO cells expressing human M1, M2, M3, M4 and ...
Ligand InfoPC cidPC sid
In DepthDetails US Patent