BDBM50301050 4-(3-(4-hydroxy-2-methoxy-5-(2-methylbut-3-en-2-yl)phenyl)acryloyl)phenyl acetate::CHEMBL578414
SMILES COc1cc(O)c(cc1\C=C\C(=O)c1ccc(OC(C)=O)cc1)C(C)(C)C=C
InChI Key InChIKey=QBVDXXCVECCUBN-FMIVXFBMSA-N
Data  1 IC50
  Tab Delimited (TSV)   2D SDfile   Computed 3D by Vconf -m prep SDfile
Find this compound or compounds like it in BindingDB:
Activity Spreadsheet -- Enzyme Inhibition Constant Data from BindingDB
Found 1 hit for monomerid = 50301050
TargetTyrosine-protein phosphatase non-receptor type 1(Homo sapiens (Human))
Institute
Curated by ChEMBL
LigandPNGBDBM50301050(4-(3-(4-hydroxy-2-methoxy-5-(2-methylbut-3-en-2-yl...)
Affinity DataIC50:  1.92E+4nM. Assay description: Inhibition of recombinant human PTP1B assessed as hydrolysis of p-nitrophenyl phosphate after 30 mins
In DepthDetails ArticlePubMed