BDBM50301055 4-(3-(2,4-dimethoxy-5-(2-methylbut-3-en-2-yl)phenyl)acryloyl)phenyl acetate::CHEMBL571219
SMILES COc1cc(OC)c(cc1\C=C\C(=O)c1ccc(OC(C)=O)cc1)C(C)(C)C=C
InChI Key InChIKey=NBRWSVMBARGCOZ-JLHYYAGUSA-N
Data  1 IC50
  Tab Delimited (TSV)   2D SDfile   Computed 3D by Vconf -m prep SDfile
Find this compound or compounds like it in BindingDB:
Activity Spreadsheet -- Enzyme Inhibition Constant Data from BindingDB
Found 1 hit for monomerid = 50301055
TargetTyrosine-protein phosphatase non-receptor type 1(Homo sapiens (Human))
Institute
Curated by ChEMBL
LigandPNGBDBM50301055(4-(3-(2,4-dimethoxy-5-(2-methylbut-3-en-2-yl)pheny...)
Affinity DataIC50:  2.92E+4nM. Assay description: Inhibition of recombinant human PTP1B assessed as hydrolysis of p-nitrophenyl phosphate after 30 mins
In DepthDetails ArticlePubMed