BDBM50302494 2-amino-4,5-dihydronaphtho[1,2-d]thiazol-7-yl dihydrogen phosphate::CHEMBL566049
SMILES Nc1nc-2c(CCc3cc(OP(O)(O)=O)ccc-23)s1
InChI Key InChIKey=KHWQDCPHOYRCNM-UHFFFAOYSA-N
Data  1 IC50
  Tab Delimited (TSV)   2D SDfile   Computed 3D by Vconf -m prep SDfile
Find this compound or compounds like it in BindingDB:
Activity Spreadsheet -- Enzyme Inhibition Constant Data from BindingDB
Found 1 hit for monomerid = 50302494
TargetFructose-1,6-bisphosphatase 1(Homo sapiens (Human))
Daiichi Sankyo
Curated by ChEMBL
LigandPNGBDBM50302494(2-amino-4,5-dihydronaphtho[1,2-d]thiazol-7-yl dihy...)
Affinity DataIC50:  1.12E+5nM. Assay description: Inhibition of human liver FBPase
In DepthDetails ArticlePubMed