BDBM50303947 2-(Benzylaminocarbonyloxy-)5-O-(m-amino-benzoyl)-1,4:3,6-dianhydro-D-glucitol::CHEMBL571396
SMILES Nc1cccc(c1)C(=O)O[C@@H]1CO[C@@H]2[C@H](CO[C@H]12)OC(=O)NCc1ccccc1
InChI Key InChIKey=QJXULLORGAAHFJ-FCGDIQPGSA-N
Data  1 IC50
  Tab Delimited (TSV)   2D SDfile   Computed 3D by Vconf -m prep SDfile
Find this compound or compounds like it in BindingDB:
Activity Spreadsheet -- Enzyme Inhibition Constant Data from BindingDB
Found 1 hit for monomerid = 50303947
TargetCholinesterase(Homo sapiens (Human))
Trinity College
Curated by ChEMBL
LigandPNGBDBM50303947(2-(Benzylaminocarbonyloxy-)5-O-(m-amino-benzoyl)-1...)
Affinity DataIC50:  86nM. Assay description: Inhibition of BuChE in human liver microsomes
In DepthDetails ArticlePubMed