BDBM50304461 2-(4,5-dichlorothiophen-3-yl)-2-oxoethyl acetate::CHEMBL595729
SMILES CC(=O)OCC(=O)c1csc(Cl)c1Cl
InChI Key InChIKey=VIWUZDDDWGXKHU-UHFFFAOYSA-N
Data  1 IC50
  Tab Delimited (TSV)   2D SDfile   Computed 3D by Vconf -m prep SDfile
Find this compound or compounds like it in BindingDB:
Activity Spreadsheet -- Enzyme Inhibition Constant Data from BindingDB
Found 1 hit for monomerid = 50304461
TargetGlycogen synthase kinase-3 beta(Homo sapiens (Human))
Instituto De Qu£Mica M£Dica-Csic
Curated by ChEMBL
LigandPNGBDBM50304461(2-(4,5-dichlorothiophen-3-yl)-2-oxoethyl acetate |...)
Affinity DataIC50: >1.00E+5nM. Assay description: Inhibition of GSK3beta by liquid scintillation counting
In DepthDetails ArticlePubMed