BDBM50305213 3-(2-hydroxyphenyl)-5-(4-hydroxyphenyl)-1N-benzoyl-4,5-dihydro-1H-pyrazole::CHEMBL591088
SMILES Oc1ccc(cc1)C1CC(=NN1C(=O)c1ccccc1)c1ccccc1O
InChI Key InChIKey=YTIZNQVDYYEKID-UHFFFAOYSA-N
Data  2 KI
  Tab Delimited (TSV)   2D SDfile   Computed 3D by Vconf -m prep SDfile
Find this compound or compounds like it in BindingDB:
Activity Spreadsheet -- Enzyme Inhibition Constant Data from BindingDB
Found 2 hits for monomerid = 50305213
TargetAmine oxidase [flavin-containing] A(Rattus norvegicus (rat))
Institute Of Technology
Curated by ChEMBL
LigandPNGBDBM50305213(3-(2-hydroxyphenyl)-5-(4-hydroxyphenyl)-1N-benzoyl...)
Affinity DataKi:  5.77E+3nM. Assay description: Inhibition of MAO-A in rat liver homogenate by spectrophotometry-based Holt method
In DepthDetails ArticlePubMed
TargetAmine oxidase [flavin-containing] B(Rattus norvegicus (rat))
Institute Of Technology
Curated by ChEMBL
LigandPNGBDBM50305213(3-(2-hydroxyphenyl)-5-(4-hydroxyphenyl)-1N-benzoyl...)
Affinity DataKi:  2.03E+7nM. Assay description: Inhibition of MAO-B in rat liver homogenate by spectrophotometry-based Holt method
In DepthDetails ArticlePubMed