BDBM50305393 CHEMBL606249::methyl 2-(1-(1-(2-chlorophenyl)-5-(4-chlorophenyl)-4-(cyanomethyl)-1H-pyrazole-3-carbonyl)piperidin-4-yl)benzoate
SMILES COC(=O)c1ccccc1C1CCN(CC1)C(=O)c1nn(c(c1CC#N)-c1ccc(Cl)cc1)-c1ccccc1Cl
InChI Key InChIKey=XLSLDHILMMPKDR-UHFFFAOYSA-N
Data  1 IC50
  Tab Delimited (TSV)   2D SDfile   Computed 3D by Vconf -m prep SDfile
Find this compound or compounds like it in BindingDB:
Activity Spreadsheet -- Enzyme Inhibition Constant Data from BindingDB
Found 1 hit for monomerid = 50305393
TargetCannabinoid receptor 1(Homo sapiens (Human))
7Tm Pharma
Curated by ChEMBL
LigandPNGBDBM50305393(CHEMBL606249 | methyl 2-(1-(1-(2-chlorophenyl)-5-(...)
Affinity DataIC50:  2.20nM. Assay description: Antagonist activity at human recombinant CB1 receptor expressed in CHO-K1 cells assessed as inhibition of CP55940-stimulated GTPgammaS binding
In DepthDetails ArticlePubMed