BDBM50306858 CHEMBL603494::aristolochic acid C
SMILES OC(=O)c1cc2OCOc2c2c3cc(O)ccc3cc([N+]([O-])=O)c12
InChI Key InChIKey=NBFGYDJKTHENDP-UHFFFAOYSA-N
Data  1 IC50
  Tab Delimited (TSV)   2D SDfile   Computed 3D by Vconf -m prep SDfile
Find this compound or compounds like it in BindingDB:
Activity Spreadsheet -- Enzyme Inhibition Constant Data from BindingDB
Found 1 hit for monomerid = 50306858
TargetCyclin-dependent kinase 2(Homo sapiens (Human))
Schering-Plough Research Institute
Curated by ChEMBL
LigandPNGBDBM50306858(CHEMBL603494 | aristolochic acid C)
Affinity DataIC50:  3.00E+4nM. Assay description: Inhibition of CDK2
In DepthDetails ArticlePubMed