BDBM50307281 (S)-1-Oxo-1-(pyrrolidin-1-yl)propan-2-yl 2-bromo-2-phenylacetate::CHEMBL597991
SMILES NC(=N)c1cc2c(O[C@H](c3nc(no3)-c3ccccc3)c3ccccc3)cccc2s1
InChI Key InChIKey=QUNDYCNUUZNGBN-NRFANRHFSA-N
Data  3 KI
  Tab Delimited (TSV)   2D SDfile   Computed 3D by Vconf -m prep SDfile
Find this compound or compounds like it in BindingDB:
Activity Spreadsheet -- Enzyme Inhibition Constant Data from BindingDB
Found 3 hits for monomerid = 50307281
TargetCoagulation factor IX(Homo sapiens (Human))
Trigen
Curated by ChEMBL
LigandPNGBDBM50307281((S)-1-Oxo-1-(pyrrolidin-1-yl)propan-2-yl 2-bromo-2...)
Affinity DataKi:  270nM. Assay description: Inhibition of human recombinant factor 9a by amidolytic assay
In DepthDetails ArticlePubMed
TargetUrokinase-type plasminogen activator(Homo sapiens (Human))
Trigen
Curated by ChEMBL
LigandPNGBDBM50307281((S)-1-Oxo-1-(pyrrolidin-1-yl)propan-2-yl 2-bromo-2...)
Affinity DataKi:  650nM. Assay description: Inhibition of uPA
In DepthDetails ArticlePubMed
TargetCoagulation factor X(Homo sapiens (Human))
Trigen
Curated by ChEMBL
LigandPNGBDBM50307281((S)-1-Oxo-1-(pyrrolidin-1-yl)propan-2-yl 2-bromo-2...)
Affinity DataKi:  3.97E+3nM. Assay description: Inhibition of factor 10a by amidolytic assay
In DepthDetails ArticlePubMed