BDBM50307799 4-Acetamidophenyl 2-(4-(2-(trifluoromethyl)pyridin-4-ylamino)benzamido)acetate::CHEMBL605981
SMILES CC(=O)Nc1ccc(OC(=O)CNC(=O)c2ccc(Nc3ccnc(c3)C(F)(F)F)cc2)cc1
InChI Key InChIKey=DPBBAMULBBJNIT-UHFFFAOYSA-N
Data  1 IC50
  Tab Delimited (TSV)   2D SDfile   Computed 3D by Vconf -m prep SDfile
Find this compound or compounds like it in BindingDB:
Activity Spreadsheet -- Enzyme Inhibition Constant Data from BindingDB
Found 1 hit for monomerid = 50307799
TargetFatty-acid amide hydrolase 1 [30-579](Rattus norvegicus (rat))
University Of Cagliari
Curated by ChEMBL
LigandPNGBDBM50307799(4-Acetamidophenyl 2-(4-(2-(trifluoromethyl)pyridin...)
Affinity DataIC50:  870nM. Assay description: Inhibition of FAAH-mediated [3H]AEA hydrolysis in rat brain homogenate by liquid scintillation spectroscopy
In DepthDetails ArticlePubMed