BDBM50307807 4-Acetamidophenyl 4-chloro-2-(2-(trifluoromethyl)pyridin-4-ylamino)benzoate::CHEMBL605348
SMILES CC(=O)Nc1ccc(OC(=O)c2ccc(Cl)cc2Nc2ccnc(c2)C(F)(F)F)cc1
InChI Key InChIKey=LWJULWMZZHPNGF-UHFFFAOYSA-N
Data  1 IC50
  Tab Delimited (TSV)   2D SDfile   Computed 3D by Vconf -m prep SDfile
Find this compound or compounds like it in BindingDB:
Activity Spreadsheet -- Enzyme Inhibition Constant Data from BindingDB
Found 1 hit for monomerid = 50307807
TargetFatty-acid amide hydrolase 1 [30-579](Rattus norvegicus (rat))
University Of Cagliari
Curated by ChEMBL
LigandPNGBDBM50307807(4-Acetamidophenyl 4-chloro-2-(2-(trifluoromethyl)p...)
Affinity DataIC50:  3.10E+4nM. Assay description: Inhibition of FAAH-mediated [3H]AEA hydrolysis in rat brain homogenate by liquid scintillation spectroscopy
In DepthDetails ArticlePubMed