BDBM50307808 4-Acetamidophenyl 5-methyl-2-(2-(trifluoromethyl)pyridin-4-ylamino)benzoate::CHEMBL597149
SMILES CC(=O)Nc1ccc(OC(=O)c2cc(C)ccc2Nc2ccnc(c2)C(F)(F)F)cc1
InChI Key InChIKey=DETOZEPLBMGISC-UHFFFAOYSA-N
Data  1 IC50
  Tab Delimited (TSV)   2D SDfile   Computed 3D by Vconf -m prep SDfile
Find this compound or compounds like it in BindingDB:
Activity Spreadsheet -- Enzyme Inhibition Constant Data from BindingDB
Found 1 hit for monomerid = 50307808
TargetFatty-acid amide hydrolase 1 [30-579](Rattus norvegicus (rat))
University Of Cagliari
Curated by ChEMBL
LigandPNGBDBM50307808(4-Acetamidophenyl 5-methyl-2-(2-(trifluoromethyl)p...)
Affinity DataIC50:  3.80E+4nM. Assay description: Inhibition of FAAH-mediated [3H]AEA hydrolysis in rat brain homogenate by liquid scintillation spectroscopy
In DepthDetails ArticlePubMed