BDBM50307809 4-Acetamidophenyl 5-chloro-2-(2-(trifluoromethyl)pyridin-4-ylamino)benzoate::CHEMBL590986
SMILES CC(=O)Nc1ccc(OC(=O)c2cc(Cl)ccc2Nc2ccnc(c2)C(F)(F)F)cc1
InChI Key InChIKey=UTYPLENILVWYIG-UHFFFAOYSA-N
Data  1 IC50
  Tab Delimited (TSV)   2D SDfile   Computed 3D by Vconf -m prep SDfile
Find this compound or compounds like it in BindingDB:
Activity Spreadsheet -- Enzyme Inhibition Constant Data from BindingDB
Found 1 hit for monomerid = 50307809
TargetFatty-acid amide hydrolase 1 [30-579](Rattus norvegicus (rat))
University Of Cagliari
Curated by ChEMBL
LigandPNGBDBM50307809(4-Acetamidophenyl 5-chloro-2-(2-(trifluoromethyl)p...)
Affinity DataIC50:  4.30E+3nM. Assay description: Inhibition of FAAH-mediated [3H]AEA hydrolysis in rat brain homogenate by liquid scintillation spectroscopy
In DepthDetails ArticlePubMed