BDBM50308739 CHEMBL589087::n-Butyl-2-methyl-5-[4-(methylsulfonyl)phenyl]-1-[3,4-(difluoro)phenyl]-1H-pyrrol-3-acetate
SMILES CCCCOC(=O)Cc1cc(-c2ccc(cc2)S(C)(=O)=O)n(c1C)-c1ccc(F)c(F)c1
InChI Key InChIKey=DGMUMHVDDMYXBQ-UHFFFAOYSA-N
Data  4 IC50
  Tab Delimited (TSV)   2D SDfile   Computed 3D by Vconf -m prep SDfile
Find this compound or compounds like it in BindingDB:
Activity Spreadsheet -- Enzyme Inhibition Constant Data from BindingDB
Found 4 hits for monomerid = 50308739
TargetProstaglandin G/H synthase 2(Mus musculus (Mouse))
Sapienza University Of Rome
Curated by ChEMBL
LigandPNGBDBM50308739(CHEMBL589087 | n-Butyl-2-methyl-5-[4-(methylsulfon...)
Affinity DataIC50:  9.00E+4nM. Assay description: Inhibition of COX2-dependent PGE2 production in LPS-stimulated mouse J774 cells at 10 uM by RIA
In DepthDetails ArticlePubMed
TargetProstaglandin G/H synthase 2(Mus musculus (Mouse))
Sapienza University Of Rome
Curated by ChEMBL
LigandPNGBDBM50308739(CHEMBL589087 | n-Butyl-2-methyl-5-[4-(methylsulfon...)
Affinity DataIC50:  8.60E+4nM. Assay description: Inhibition of COX2-dependent PGE2 production in LPS-stimulated mouse J774 cells at 1 uM by RIA
In DepthDetails ArticlePubMed
TargetProstaglandin G/H synthase 1(Mus musculus)
Sapienza University Of Rome
Curated by ChEMBL
LigandPNGBDBM50308739(CHEMBL589087 | n-Butyl-2-methyl-5-[4-(methylsulfon...)
Affinity DataIC50: >1.00E+5nM. Assay description: Inhibition of COX1-dependent PGE2 production in LPS-stimulated mouse J774 cells by RIA
In DepthDetails ArticlePubMed
TargetProstaglandin G/H synthase 2(Mus musculus (Mouse))
Sapienza University Of Rome
Curated by ChEMBL
LigandPNGBDBM50308739(CHEMBL589087 | n-Butyl-2-methyl-5-[4-(methylsulfon...)
Affinity DataIC50:  30nM. Assay description: Inhibition of COX2-dependent PGE2 production in LPS-stimulated mouse J774 cells by RIA
In DepthDetails ArticlePubMed