BDBM50309614 1-((5'-chloro-3,3'-difluoro-2'-(2-methyl-2H-tetrazol-5-yl)biphenyl-4-yl)methyl)-3-hydroxyurea::CHEMBL598868
SMILES Cn1nnc(n1)-c1c(F)cc(Cl)cc1-c1cnc(CNC(=O)NO)c(F)c1
InChI Key InChIKey=BZNHUFACHKTUTC-UHFFFAOYSA-N
Data  1 IC50
  Tab Delimited (TSV)   2D SDfile   Computed 3D by Vconf -m prep SDfile
Find this compound or compounds like it in BindingDB:
Activity Spreadsheet -- Enzyme Inhibition Constant Data from BindingDB
Found 1 hit for monomerid = 50309614
TargetB1 bradykinin receptor(Homo sapiens (Human))
Jerini
Curated by ChEMBL
LigandPNGBDBM50309614(1-((5'-chloro-3,3'-difluoro-2'-(2-methyl-2H-tetraz...)
Affinity DataIC50:  59nM. Assay description: Antagonist activity at bradikinin B1 receptor in human IMR90 cells assessed as inhibition of des-Arg-bradykinin-mediated calcium mobilization
In DepthDetails ArticlePubMed