BDBM50310116 (Z)-(4-(16-hydroxyhexadecylidene)-2-(hydroxymethyl)-5-oxotetrahydrofuran-2-yl)methyl pivalate::CHEMBL596829
SMILES CC(C)(C)C(=O)OCC1(CO)C\C(=C\CCCCCCCCCCCCCCCO)C(=O)O1
InChI Key InChIKey=DFCYEUFARMLJCI-NKFKGCMQSA-N
Data  1 KI
  Tab Delimited (TSV)   2D SDfile   Computed 3D by Vconf -m prep SDfile
Find this compound or compounds like it in BindingDB:
Activity Spreadsheet -- Enzyme Inhibition Constant Data from BindingDB
Found 1 hit for monomerid = 50310116
TargetProtein kinase C alpha type(Homo sapiens (Human))
Seoul National University
Curated by ChEMBL
LigandPNGBDBM50310116((Z)-(4-(16-hydroxyhexadecylidene)-2-(hydroxymethyl...)
Affinity DataKi:  8.20nM. Assay description: Displacement of [20-3H]phorbol 12,13-dibutyrate from recombinant PKCalpha
In DepthDetails ArticlePubMed