BDBM50310128 (E)-(4-(16-azidohexadecylidene)-2-(hydroxymethyl)-5-oxotetrahydrofuran-2-yl)methyl pivalate::CHEMBL597697
SMILES CC(C)(C)C(=O)OCC1(CO)C\C(=C/CCCCCCCCCCCCCCCN=[N+]=[N-])C(=O)O1
InChI Key InChIKey=VDJVOLAXYVCRCG-PTGBLXJZSA-N
Data  1 KI
  Tab Delimited (TSV)   2D SDfile   Computed 3D by Vconf -m prep SDfile
Find this compound or compounds like it in BindingDB:
Activity Spreadsheet -- Enzyme Inhibition Constant Data from BindingDB
Found 1 hit for monomerid = 50310128
TargetProtein kinase C alpha type(Homo sapiens (Human))
Seoul National University
Curated by ChEMBL
LigandPNGBDBM50310128((E)-(4-(16-azidohexadecylidene)-2-(hydroxymethyl)-...)
Affinity DataKi:  16nM. Assay description: Displacement of [20-3H]phorbol 12,13-dibutyrate from recombinant PKCalpha
In DepthDetails ArticlePubMed