BDBM50310189 2-(4-Methoxy-phenyl)-chromen-4-one::2-(4-methoxyphenyl)-4H-chromen-4-one::4'-methoxyflavone::4-methoxy flavone::CHEMBL16312::cid_77793
SMILES COc1ccc(cc1)-c1cc(=O)c2ccccc2o1
InChI Key InChIKey=OMICQBVLCVRFGN-UHFFFAOYSA-N
Data  2 KI  4 IC50
PDB links: 1 PDB ID matches this monomer.
  Tab Delimited (TSV)   2D SDfile   Computed 3D by Vconf -m prep SDfile
Find this compound or compounds like it in BindingDB:
Activity Spreadsheet -- Enzyme Inhibition Constant Data from BindingDB
Found 6 hits for monomerid = 50310189
TargetAmine oxidase [flavin-containing] B(Homo sapiens (Human))
Birla Institute of Technology
LigandPNGBDBM50310189(2-(4-Methoxy-phenyl)-chromen-4-one | 2-(4-methoxyp...)
Affinity DataKi:  1.80E+3nM. Assay description: The activities of recombinant hMAO-A and hMAO-B were determined using p-tyramine as common substrate and calculated as 0.18 +/- 0.01 nmol/mg/min (n =...
In DepthDetails ArticlePubMed
TargetAmine oxidase [flavin-containing] A(Homo sapiens (Human))
Birla Institute of Technology
LigandPNGBDBM50310189(2-(4-Methoxy-phenyl)-chromen-4-one | 2-(4-methoxyp...)
Affinity DataKi:  2.64E+3nM. Assay description: The activities of recombinant hMAO-A and hMAO-B were determined using p-tyramine as common substrate and calculated as 0.18 +/- 0.01 nmol/mg/min (n =...
In DepthDetails ArticlePubMed
TargetNeuraminidase(Influenza A virus (A/Puerto Rico/8/34/Mount Sinai(...)
Prin. K.M. Kundnani College Of Pharmacy
Curated by ChEMBL
LigandPNGBDBM50310189(2-(4-Methoxy-phenyl)-chromen-4-one | 2-(4-methoxyp...)
Affinity DataIC50:  8.74E+3nM. Assay description: Inhibition of Influenza A virus (H1N1) neuraminidase
In DepthDetails ArticlePubMed
TargetNACHT, LRR and PYD domains-containing protein 3(Homo sapiens (Human))
Burnham Center For Chemical Genomics
Curated by PubChem BioAssay
LigandPNGBDBM50310189(2-(4-Methoxy-phenyl)-chromen-4-one | 2-(4-methoxyp...)
Affinity DataIC50:  3.10E+4nM. Assay description: Data Source: Sanford-Burnham Center for Chemical Genomics (SBCCG) Source Affiliation: Sanford-Burnham Medical Research Institute (SBMRI, San Diego, C...
In DepthDetails PCBioAssay
TargetAmine oxidase [flavin-containing] B(Homo sapiens (Human))
Birla Institute of Technology
LigandPNGBDBM50310189(2-(4-Methoxy-phenyl)-chromen-4-one | 2-(4-methoxyp...)
Affinity DataIC50:  2.79E+4nM. Assay description: Inhibition of human recombinant MAOB expressed in BTI-TN-5B1-4 cells by para-tyramine oxidation assay
In DepthDetails ArticlePubMed
TargetNACHT, LRR and PYD domains-containing protein 3(Homo sapiens (Human))
Burnham Center For Chemical Genomics
Curated by PubChem BioAssay
LigandPNGBDBM50310189(2-(4-Methoxy-phenyl)-chromen-4-one | 2-(4-methoxyp...)
Affinity DataIC50:  5.40E+3nM. Assay description: Data Source: Sanford-Burnham Center for Chemical Genomics (SBCCG) Source Affiliation: Sanford-Burnham Medical Research Institute (SBMRI, San Diego, C...
In DepthDetails PCBioAssay