BDBM50310432 CHEMBL1084674::N-[(1-methyl-1H-indol-3-yl)methyl]sulfamide
SMILES Cn1cc(CNS(N)(=O)=O)c2ccccc12
InChI Key InChIKey=VDJMRDZYIHDQCM-UHFFFAOYSA-N
Data  1 IC50
  Tab Delimited (TSV)   2D SDfile   Computed 3D by Vconf -m prep SDfile
Find this compound or compounds like it in BindingDB:
Activity Spreadsheet -- Enzyme Inhibition Constant Data from BindingDB
Found 1 hit for monomerid = 50310432
TargetCarbonic anhydrase 2(Homo sapiens (Human))
Johnson & Johnson Pharmaceutical Research & Development
Curated by ChEMBL
LigandPNGBDBM50310432(CHEMBL1084674 | N-[(1-methyl-1H-indol-3-yl)methyl]...)
Affinity DataIC50:  4.80E+4nM. Assay description: Inhibition of human carbonic anhydrase 2 by CO2 hydration assay
In DepthDetails ArticlePubMed