BDBM50310597 2-benzoyl-5,6-dimethoxy-2,3-dihydro-1H-inden-1-one::CHEMBL1078257
SMILES COc1cc2CC(C(=O)c3ccccc3)C(=O)c2cc1OC
InChI Key InChIKey=MBPDTIPFHQRJDG-UHFFFAOYSA-N
Data  1 IC50
  Tab Delimited (TSV)   2D SDfile   Computed 3D by Vconf -m prep SDfile
Find this compound or compounds like it in BindingDB:
Activity Spreadsheet -- Enzyme Inhibition Constant Data from BindingDB
Found 1 hit for monomerid = 50310597
TargetAcetylcholinesterase(Electrophorus electricus (Electric eel))
Alwar Pharmacy College
Curated by ChEMBL
LigandPNGBDBM50310597(2-benzoyl-5,6-dimethoxy-2,3-dihydro-1H-inden-1-one...)
Affinity DataIC50:  2.10E+4nM. Assay description: Inhibition of Electrophorus electricus AChE by Ellman's method
In DepthDetails ArticlePubMed