BDBM50312266 (4-(3-(3,5-bis(trifluoromethyl)phenyl)ureido)phenyl)difluoromethylphosphonic acid::CHEMBL1081956
SMILES OP(O)(=O)C(F)(F)c1ccc(NC(=O)Nc2cc(cc(c2)C(F)(F)F)C(F)(F)F)cc1
InChI Key InChIKey=YNNVPTNBEAKHTB-UHFFFAOYSA-N
Data  1 KI
  Tab Delimited (TSV)   2D SDfile   Computed 3D by Vconf -m prep SDfile
Find this compound or compounds like it in BindingDB:
Activity Spreadsheet -- Enzyme Inhibition Constant Data from BindingDB
Found 1 hit for monomerid = 50312266
TargetLow molecular weight protein-tyrosine phosphatase A(Mycobacterium tuberculosis)
University Of California
Curated by ChEMBL
LigandPNGBDBM50312266((4-(3-(3,5-bis(trifluoromethyl)phenyl)ureido)pheny...)
Affinity DataKi:  3.10E+3nM. Assay description: Inhibition of Mycobacterium tuberculosis PtpA
In DepthDetails ArticlePubMed