BDBM50312279 (+/-)-N-(1-benzoyl-2-methyl-1,2,3,4-tetrahydroquinolin-4-yl)-N-phenylpentanamide::CHEMBL1081787
SMILES CCCCC(=O)N(C1CC(C)N(C(=O)c2ccccc2)c2ccccc12)c1ccccc1
InChI Key InChIKey=ZNIFAUWONSYYQK-UHFFFAOYSA-N
Data  1 IC50
  Tab Delimited (TSV)   2D SDfile   Computed 3D by Vconf -m prep SDfile
Find this compound or compounds like it in BindingDB:
Activity Spreadsheet -- Enzyme Inhibition Constant Data from BindingDB
Found 1 hit for monomerid = 50312279
TargetProstaglandin D2 receptor 2(Homo sapiens (Human))
Amgen
Curated by ChEMBL
LigandPNGBDBM50312279((+/-)-N-(1-benzoyl-2-methyl-1,2,3,4-tetrahydroquin...)
Affinity DataIC50:  64nM. Assay description: Displacement of [3H]PGD2 from human CRTH2 receptor expressed in 293 cells by scintillation counting in presence of 0.5% BSA
In DepthDetails ArticlePubMed