BDBM50315256 CHEMBL1089224::Methyl{3-[(6-amino-2-butoxy-8-oxo-7,8-dihydro-9H-purin-9-yl)methyl]phenyl}acetate
SMILES CCCCOc1nc(N)c2[nH]c(=O)n(Cc3cccc(CC(=O)OC)c3)c2n1
InChI Key InChIKey=MXILFZWMVNDOIZ-UHFFFAOYSA-N
Data  2 EC50
  Tab Delimited (TSV)   2D SDfile   Computed 3D by Vconf -m prep SDfile
Find this compound or compounds like it in BindingDB:
Activity Spreadsheet -- Enzyme Inhibition Constant Data from BindingDB
Found 2 hits for monomerid = 50315256
TargetToll-like receptor 7(Homo sapiens (Human))
Dainippon Sumitomo Pharma
Curated by ChEMBL
LigandPNGBDBM50315256(CHEMBL1089224 | Methyl{3-[(6-amino-2-butoxy-8-oxo-...)
Affinity DataEC50:  50.1nM. Assay description: Agonist activity at human TLR7 expressed in HEK293 cells coexpressing pNiFty2-SEAP reporter by reporter gene assay
In DepthDetails ArticlePubMed
TargetToll-like receptor 8(Homo sapiens (Human))
Dainippon Sumitomo Pharma
Curated by ChEMBL
LigandPNGBDBM50315256(CHEMBL1089224 | Methyl{3-[(6-amino-2-butoxy-8-oxo-...)
Affinity DataEC50: >1.00E+4nM. Assay description: Agonist activity at TLR8
In DepthDetails ArticlePubMed