BDBM50315551 (S)-methyl 5-(2-amino-2-methyl-3-(phosphonooxy)propanamido)-2-(2-(biphenyl-4-yl)ethoxy)benzoate::CHEMBL1092190
SMILES COC(=O)c1cc(NC(=O)[C@@](C)(N)COP(O)(O)=O)ccc1OCCc1ccc(cc1)-c1ccccc1
InChI Key InChIKey=GUDHOVSDMARPGH-SANMLTNESA-N
Data  2 IC50
  Tab Delimited (TSV)   2D SDfile   Computed 3D by Vconf -m prep SDfile
Find this compound or compounds like it in BindingDB:
Activity Spreadsheet -- Enzyme Inhibition Constant Data from BindingDB
Found 2 hits for monomerid = 50315551
TargetSphingosine 1-phosphate receptor 3(Homo sapiens (Human))
Praecis Pharmaceuticals
Curated by ChEMBL
LigandPNGBDBM50315551((S)-methyl 5-(2-amino-2-methyl-3-(phosphonooxy)pro...)
Affinity DataIC50: >1.00E+4nM. Assay description: Displacement of [33P]sphingosine-1-phosphate from human S1P3 receptor expressed in HEK293T cells after 60 mins by scintillation counting
In DepthDetails ArticlePubMed
TargetSphingosine 1-phosphate receptor 1(Homo sapiens (Human))
Praecis Pharmaceuticals
Curated by ChEMBL
LigandPNGBDBM50315551((S)-methyl 5-(2-amino-2-methyl-3-(phosphonooxy)pro...)
Affinity DataIC50:  21nM. Assay description: Displacement of [33P]sphingosine-1-phosphate from human S1P1 receptor expressed in HEK293T cells after 60 mins by scintillation counting
In DepthDetails ArticlePubMed