BDBM50316380 (S)-Ethyl-2-(3-(2-aminoacetamido)-2,6-dioxopiper idin-1-yl)acetate hydrochloride::CHEMBL1095916
SMILES CCOC(=O)CN1C(=O)CC[C@H](NC(=O)CN)C1=O
InChI Key InChIKey=HVGOFCSWHIFQEK-ZETCQYMHSA-N
Data  1 IC50
  Tab Delimited (TSV)   2D SDfile   Computed 3D by Vconf -m prep SDfile
Find this compound or compounds like it in BindingDB:
Activity Spreadsheet -- Enzyme Inhibition Constant Data from BindingDB
Found 1 hit for monomerid = 50316380
TargetAminopeptidase N(Homo sapiens (Human))
Shandong University
Curated by ChEMBL
LigandPNGBDBM50316380((S)-Ethyl-2-(3-(2-aminoacetamido)-2,6-dioxopiper i...)
Affinity DataIC50:  2.37E+4nM. Assay description: Inhibition of aminopeptidase N
In DepthDetails ArticlePubMed