BDBM50316388 CHEMBL1099254::Ethyl-2-((S)-3-((S)-2-amino-3-(1H-indol-3-yl)propanamido)-2,6-dioxopiperidin-1-yl)acetate hydrochloride
SMILES CCOC(=O)CN1C(=O)CC[C@H](NC(=O)[C@@H](N)Cc2c[nH]c3ccccc23)C1=O
InChI Key InChIKey=NVODQEUITYNNNJ-HOCLYGCPSA-N
Data  1 IC50
  Tab Delimited (TSV)   2D SDfile   Computed 3D by Vconf -m prep SDfile
Find this compound or compounds like it in BindingDB:
Activity Spreadsheet -- Enzyme Inhibition Constant Data from BindingDB
Found 1 hit for monomerid = 50316388
TargetAminopeptidase N(Homo sapiens (Human))
Shandong University
Curated by ChEMBL
LigandPNGBDBM50316388(CHEMBL1099254 | Ethyl-2-((S)-3-((S)-2-amino-3-(1H-...)
Affinity DataIC50:  2.07E+4nM. Assay description: Inhibition of aminopeptidase N
In DepthDetails ArticlePubMed