BDBM50317310 1-(4-(3-morpholinopropylsulfonyl)phenyl)-3-(4-(trifluoromethyl)phenyl)urea::CHEMBL1088227
SMILES FC(F)(F)c1ccc(NC(=O)Nc2ccc(cc2)S(=O)(=O)CCCN2CCOCC2)cc1
InChI Key InChIKey=SNYQXKCNJRCESG-UHFFFAOYSA-N
Data  1 IC50
  Tab Delimited (TSV)   2D SDfile   Computed 3D by Vconf -m prep SDfile
Find this compound or compounds like it in BindingDB:
Activity Spreadsheet -- Enzyme Inhibition Constant Data from BindingDB
Found 1 hit for monomerid = 50317310
TargetBifunctional epoxide hydrolase 2(Homo sapiens (Human))
Ar£Te Therapeutics
Curated by ChEMBL
LigandPNGBDBM50317310(1-(4-(3-morpholinopropylsulfonyl)phenyl)-3-(4-(tri...)
Affinity DataIC50:  1nM. Assay description: Inhibition of soluble epoxide hydrolase by fluorescence assay
In DepthDetails ArticlePubMed