BDBM50317374 CHEMBL1098791::methyl 2-(4,6-dioxo-3-stearoylpyrrolo[3,4-c]pyrazol-5(1H,4H,6H)-yl)benzoate
SMILES CCCCCCCCCCCCCCCCCC(=O)c1n[nH]c2C(=O)N(C(=O)c12)c1ccccc1C(=O)OC
InChI Key InChIKey=WSCWPDFPLKDXHU-UHFFFAOYSA-N
Data  1 IC50
  Tab Delimited (TSV)   2D SDfile   Computed 3D by Vconf -m prep SDfile
Find this compound or compounds like it in BindingDB:
Activity Spreadsheet -- Enzyme Inhibition Constant Data from BindingDB
Found 1 hit for monomerid = 50317374
TargetM-phase inducer phosphatase 2(Homo sapiens (Human))
Chinese Academy Of Sciences
Curated by ChEMBL
LigandPNGBDBM50317374(CHEMBL1098791 | methyl 2-(4,6-dioxo-3-stearoylpyrr...)
Affinity DataIC50:  410nM. Assay description: Inhibition of CDC25B
In DepthDetails ArticlePubMed