BDBM50317548 CHEMBL1097034::lupeol 3-acetate
SMILES CC(=O)O[C@H]1CC[C@@]2(C)[C@@H](CC[C@]3(C)[C@@H]2CC[C@H]2[C@@H]4[C@@H](CC[C@]4(C)CC[C@@]32C)C(C)=C)C1(C)C
InChI Key InChIKey=ODSSDTBFHAYYMD-YQFDXMDDSA-N
Data  1 IC50
  Tab Delimited (TSV)   2D SDfile   Computed 3D by Vconf -m prep SDfile
Find this compound or compounds like it in BindingDB:
Activity Spreadsheet -- Enzyme Inhibition Constant Data from BindingDB
Found 1 hit for monomerid = 50317548
TargetDNA topoisomerase 2-alpha(Homo sapiens (Human))
Stephen F. Austin State University
Curated by ChEMBL
LigandPNGBDBM50317548(CHEMBL1097034 | lupeol 3-acetate)
Affinity DataIC50: >2.50E+5nM. Assay description: Inhibition of human DNA topoisomerase 2-mediated relaxation of supercoiled DNA by gel electrophoresis
In DepthDetails ArticlePubMed