BDBM50318338 CHEMBL1094462::methyl 4-(5-hexyl-2-oxooxazolidin-3-yl)benzoate
SMILES CCCCCCC1CN(C(=O)O1)c1ccc(cc1)C(=O)OC
InChI Key InChIKey=BVQCYNKNLJULEW-UHFFFAOYSA-N
Data  1 EC50
  Tab Delimited (TSV)   2D SDfile   Computed 3D by Vconf -m prep SDfile
Find this compound or compounds like it in BindingDB:
Activity Spreadsheet -- Enzyme Inhibition Constant Data from BindingDB
Found 1 hit for monomerid = 50318338
TargetMetabotropic glutamate receptor 2(Homo sapiens (Human))
Merck Research Laboratories
Curated by ChEMBL
LigandPNGBDBM50318338(CHEMBL1094462 | methyl 4-(5-hexyl-2-oxooxazolidin-...)
Affinity DataEC50:  1.22E+3nM. Assay description: Allosteric modulation of human mGluR2 expressed in CHO dhfr cells co-expressing G-protein Galpha16 assessed as potentiation of glutamate-induced calc...
In DepthDetails ArticlePubMed