BDBM50318929 2-(3,5-bis(trifluoromethyl)phenyl)-N-(4-(2-chlorophenyl)-6-(2-methoxyethylamino)pyridin-3-yl)-N,2-dimethylpropanamide::CHEMBL1086004
SMILES COCCNc1cc(c(cn1)N(C)C(=O)C(C)(C)c1cc(cc(c1)C(F)(F)F)C(F)(F)F)-c1ccccc1Cl
InChI Key InChIKey=KPSHRAGASWDIHK-UHFFFAOYSA-N
Data  2 KI
  Tab Delimited (TSV)   2D SDfile   Computed 3D by Vconf -m prep SDfile
Find this compound or compounds like it in BindingDB:
Activity Spreadsheet -- Enzyme Inhibition Constant Data from BindingDB
Found 2 hits for monomerid = 50318929
TargetSubstance-P receptor(Homo sapiens (Human))
F. Hoffmann-La Roche
Curated by ChEMBL
LigandPNGBDBM50318929(2-(3,5-bis(trifluoromethyl)phenyl)-N-(4-(2-chlorop...)
Affinity DataKi:  3.05nM. Assay description: Displacement of [3H]substance P from human NK1 receptor expressed in CHO cells
In DepthDetails ArticlePubMed
TargetNeuromedin-K receptor(Homo sapiens (Human))
F. Hoffmann-La Roche
Curated by ChEMBL
LigandPNGBDBM50318929(2-(3,5-bis(trifluoromethyl)phenyl)-N-(4-(2-chlorop...)
Affinity DataKi:  93.3nM. Assay description: Displacement of [3H]SR142801 from human NK3 receptor expressed in HEK-293-EBNA cells
In DepthDetails ArticlePubMed